Compiling error in Vulnerability Manager

Hello I am trying to install the OpenVas Manger and I am presented with this error
/opt/gvmd-8.0-beta2/src/gvmd.c: In function 'cleanup': /opt/gvmd-8.0-beta2/src/gvmd.c:921:3: error: implicit declaration of function 'gvm_auth_tear_down'; did you mean 'gvm_auth_init'? [-Werror=implicit-function-declaration] gvm_auth_tear_down (); ^~~~~~~~~~~~~~~~~~ gvm_auth_init cc1: all warnings being treated as errors src/CMakeFiles/gvmd-sqlite.dir/build.make:62: recipe for target 'src/CMakeFiles/gvmd-sqlite.dir/gvmd.c.o' failed make[2]: *** [src/CMakeFiles/gvmd-sqlite.dir/gvmd.c.o] Error 1 make[1]: *** [src/CMakeFiles/gvmd-sqlite.dir/all] Error 2 CMakeFiles/Makefile2:122: recipe for target 'src/CMakeFiles/gvmd-sqlite.dir/all' failed Makefile:151: recipe for target 'all' failed make: *** [all] Error 2

The sqllite version is 3.22.0
I was able to install OpenVas-Scanner , GSA , and the GVM libs

Fixed already in the current release branch